Reaction Details
TargetPhosphatidylinositol 3-kinase regulatory subunit alpha/4,5-bisphosphate 3-kinase catalytic subunit delta isoform
LigandBDBM50575884
Substrate/Competitorn/a
Meas. Tech.ChEMBL_2126105 (CHEMBL4835450)
IC50 0.200000±n/a nM
Citation Methot, JLZhou, HMcGowan, MAAnthony, NJChristopher, MGarcia, YAchab, ALipford, KTrotter, BWAltman, MDFradera, XLesburg, CALi, CAlves, SChappell, CPJain, RMangado, RPinheiro, EWilliams, SMGGoldenblatt, PHill, AShaffer, LChen, DTong, VMcLeod, RLLee, HHYu, HShah, SKatz, JD Projected Dose Optimization of Amino- and Hydroxypyrrolidine Purine PI3K? Immunomodulators. J Med Chem64:5137-5156 (2021) 
 
Phosphatidylinositol 3-kinase regulatory subunit alpha/4,5-bisphosphate 3-kinase catalytic subunit delta isoform
Name:Phosphatidylinositol 3-kinase regulatory subunit alpha/4,5-bisphosphate 3-kinase catalytic subunit delta isoform
Type:Heterodimer of a p110 (catalytic) and a p85 (regulatory) subunit
Mol. Mass.:n/a
Description:Recombinant human p110delta was coexpressed in an Sf9 baculovirus system with the p85alpha regulatory subunit and purified as GST-fusion protein using affinity chromatography on glutathione-sepharose.
Components:This complex has 2 components.
Component 1
Name:Phosphatidylinositol 4,5-bisphosphate 3-kinase catalytic subunit delta isoform
Synonyms:PI3-kinase p110 subunit delta PI3-kinase subunit p110-delta PIK3CD Phosphatidylinositol 4,5-biphosphate 3-kinase catalytic subunit delta (PIK3CD) Phosphatidylinositol 4,5-bisphosphate 3-kinase 110 kDa catalytic subunit delta (PI3K delta) Phosphatidylinositol 4,5-bisphosphate 3-kinase catalytic subunit delta (PI3Kdelta) Phosphatidylinositol 4,5-bisphosphate 3-kinase catalytic subunit delta isoform (PI3K delta) Phosphatidylinositol 4,5-bisphosphate 3-kinase catalytic subunit delta isoform (PI3K-delta) Phosphatidylinositol 4,5-bisphosphate 3-kinase catalytic subunit delta isoform (PI3Kdelta)
Type:Enzyme Subunit
Mol. Mass.:119489.41
Organism:Homo sapiens (Human)
Description:O00329
Residue:1044
Component 2
Name:Phosphatidylinositol 3-kinase regulatory subunit alpha
Synonyms:GRB1 PI3-kinase class I PI3-kinase p85-alpha subunit PI3-kinase subunit p85-alpha PIK3CG/PIK3R1 Phosphatidylinositol 3-kinase 85 kDa regulatory subunit alpha (PI3K alpha) Phosphatidylinositol 3-kinase regulatory subunit alpha (PIK3R1) Phosphatidylinositol 3-kinase regulatory subunit alpha isoform 1 (PI3 Kinase alpha) Phosphatidylinositol 4,5-bisphosphate 3-kinase catalytic subunit alpha isoform (PI3Kalpha) PtdIns-3-kinase p85-alpha p85 alpha
Type:Protein
Mol. Mass.:83592.82
Organism:Homo sapiens (Human)
Description:P27986
Residue:724
BDBM50575884
NameBDBM50575884
Synonyms:CHEMBL4849371
TypeSmall organic molecule
Emp. Form.C20H28N8O
Mol. Mass.396.4893
SMILESCCC(=O)N1CC[C@@H](C1)Nc1ncnc2n(CC)c(nc12)-c1cnn(CC)c1C