Reaction Details
TargetMisshapen-like kinase 1
LigandBDBM50577194
Substrate/Competitorn/a
Meas. Tech.ChEMBL_2129709 (CHEMBL4839138)
IC50 335±n/a nM
Citation Li, YYang, GZhang, JTang, PYang, CWang, GChen, JLiu, JZhang, LOuyang, L Discovery, Synthesis, and Evaluation of Highly Selective Vascular Endothelial Growth Factor Receptor 3 (VEGFR3) Inhibitor for the Potential Treatment of Metastatic Triple-Negative Breast Cancer. J Med Chem64:12022-12048 (2021) 
 
Misshapen-like kinase 1
Name:Misshapen-like kinase 1
Type:PROTEIN
Mol. Mass.:149838.92
Organism:Homo sapiens (Human)
Description:ChEMBL_793919
Residue:1332
BDBM50577194
NameBDBM50577194
Synonyms:CHEMBL4874448
TypeSmall organic molecule
Emp. Form.C29H29ClF3N7OS
Mol. Mass.616.1
SMILESCN1CCN(CC1)c1ccc(cc1)-c1cc2c(ncnc2s1)N1CCN(CC1)C(=O)Nc1ccc(Cl)c(c1)C(F)(F)F