Reaction Details
TargetCoagulation factor X
LigandBDBM50144092
Substrate/Competitorn/a
Meas. Tech.ChEMBL_48628 (CHEMBL659609)
IC50 5±n/a nM
Citation Jia, ZJSu, TZuckett, JFWu, YGoldman, EALi, WZhang, PClizbe, LASong, YBauer, SMHuang, WWoolfrey, JSinha, UArfsten, AEHutchaleelaha, AHollenbach, SJLambing, JLScarborough, RMZhu, BY N,N-Dialkylated 4-(4-arylsulfonylpiperazine-1-carbonyl)-benzamidines and 4-((4-arylsulfonyl)-2-oxo-piperazin-1-ylmethyl)-benzamidines as potent factor Xa inhibitors. Bioorg Med Chem Lett14:2073-8 (2004) 
 
Coagulation factor X
Name:Coagulation factor X
Type:Enzyme
Mol. Mass.:54726.60
Organism:Homo sapiens (Human)
Description:n/a
Residue:488
BDBM50144092
NameBDBM50144092
Synonyms:CHEMBL294121 | [4-(5-Chloro-1H-indole-2-sulfonyl)-piperazin-1-yl]-[4-(1-methyl-4,5-dihydro-1H-imidazol-2-yl)-phenyl]-methanone
TypeSmall organic molecule
Emp. Form.C23H24ClN5O3S
Mol. Mass.485.986
SMILESCN1CCN=C1c1ccc(cc1)C(=O)N1CCN(CC1)S(=O)(=O)c1cc2cc(Cl)ccc2[nH]1