Reaction Details
TargetCoagulation factor X
LigandBDBM50144089
Substrate/Competitorn/a
Meas. Tech.ChEBML_48628
IC50 100±n/a nM
Citation Jia, ZJSu, TZuckett, JFWu, YGoldman, EALi, WZhang, PClizbe, LASong, YBauer, SMHuang, WWoolfrey, JSinha, UArfsten, AEHutchaleelaha, AHollenbach, SJLambing, JLScarborough, RMZhu, BY N,N-Dialkylated 4-(4-arylsulfonylpiperazine-1-carbonyl)-benzamidines and 4-((4-arylsulfonyl)-2-oxo-piperazin-1-ylmethyl)-benzamidines as potent factor Xa inhibitors. Bioorg Med Chem Lett14:2073-8 (2004) 
 
Coagulation factor X
Name:Coagulation factor X
Type:Enzyme
Mol. Mass.:54726.60
Organism:Homo sapiens (Human)
Description:n/a
Residue:488
BDBM50144089
NameBDBM50144089
Synonyms:4-(6-Chloro-benzo[b]thiophene-2-sulfonyl)-1-[4-(imino-piperidin-1-yl-methyl)-benzyl]-piperazin-2-one | CHEMBL305097
TypeSmall organic molecule
Emp. Form.C25H27ClN4O3S2
Mol. Mass.531.09
SMILESClc1ccc2cc(sc2c1)S(=O)(=O)N1CCN(Cc2ccc(cc2)C(=N)N2CCCCC2)C(=O)C1