Reaction Details
TargetCoagulation factor X
LigandBDBM50144130
Substrate/Competitorn/a
Meas. Tech.ChEBML_48628
IC50 25±n/a nM
Citation Jia, ZJSu, TZuckett, JFWu, YGoldman, EALi, WZhang, PClizbe, LASong, YBauer, SMHuang, WWoolfrey, JSinha, UArfsten, AEHutchaleelaha, AHollenbach, SJLambing, JLScarborough, RMZhu, BY N,N-Dialkylated 4-(4-arylsulfonylpiperazine-1-carbonyl)-benzamidines and 4-((4-arylsulfonyl)-2-oxo-piperazin-1-ylmethyl)-benzamidines as potent factor Xa inhibitors. Bioorg Med Chem Lett14:2073-8 (2004) 
 
Coagulation factor X
Name:Coagulation factor X
Type:Enzyme
Mol. Mass.:54726.60
Organism:Homo sapiens (Human)
Description:n/a
Residue:488
BDBM50144130
NameBDBM50144130
Synonyms:CHEMBL65128 | [4-(Azetidin-1-yl-imino-methyl)-phenyl]-[4-(6-chloro-benzo[b]thiophene-2-sulfonyl)-piperazin-1-yl]-methanone
TypeSmall organic molecule
Emp. Form.C23H23ClN4O3S2
Mol. Mass.503.037
SMILESClc1ccc2cc(sc2c1)S(=O)(=O)N1CCN(CC1)C(=O)c1ccc(cc1)C(=N)N1CCC1