Reaction Details
TargetProthrombin
LigandBDBM50144143
Substrate/Competitorn/a
Meas. Tech.ChEBML_209072
IC50 3.2±n/a nM
Citation Jia, ZJSu, TZuckett, JFWu, YGoldman, EALi, WZhang, PClizbe, LASong, YBauer, SMHuang, WWoolfrey, JSinha, UArfsten, AEHutchaleelaha, AHollenbach, SJLambing, JLScarborough, RMZhu, BY N,N-Dialkylated 4-(4-arylsulfonylpiperazine-1-carbonyl)-benzamidines and 4-((4-arylsulfonyl)-2-oxo-piperazin-1-ylmethyl)-benzamidines as potent factor Xa inhibitors. Bioorg Med Chem Lett14:2073-8 (2004) 
 
Prothrombin
Name:Prothrombin
Type:Protein
Mol. Mass.:70029.57
Organism:Homo sapiens (Human)
Description:P00734
Residue:622
BDBM50144143
NameBDBM50144143
Synonyms:2-{4-(6-Chloro-benzo[b]thiophene-2-sulfonyl)-1-[4-(1-methyl-4,5-dihydro-1H-imidazol-2-yl)-benzoyl]-piperazin-2-yl}-1-morpholin-4-yl-ethanone | CHEMBL65219
TypeSmall organic molecule
Emp. Form.C29H32ClN5O5S2
Mol. Mass.630.178
SMILESCN1CCN=C1c1ccc(cc1)C(=O)N1CCN(CC1CC(=O)N1CCOCC1)S(=O)(=O)c1cc2ccc(Cl)cc2s1