Reaction Details
TargetBeta-2 adrenergic receptor
LigandBDBM50578591
Substrate/Competitorn/a
Meas. Tech.ChEMBL_2133588 (CHEMBL4843198)
EC50 0.028184±n/a nM
Citation Xing, GZhi, ZYi, CZou, JJing, XYiu-Ho Woo, ALin, BPan, LZhang, YCheng, M 8-Hydroxyquinolin-2(1H)-one analogues as potential ? Eur J Med Chem224:0 (2021) 
 
Beta-2 adrenergic receptor
Name:Beta-2 adrenergic receptor
Type:n/a
Mol. Mass.:46461.69
Organism:Homo sapiens (Human)
Description:P07550
Residue:413
BDBM50578591
NameBDBM50578591
Synonyms:CHEMBL4872653
TypeSmall organic molecule
Emp. Form.C21H22ClF3N2O3
Mol. Mass.442.859
SMILESCl.OC(CNCCCc1cccc(c1)C(F)(F)F)c1ccc(O)c2[nH]c(=O)ccc12