Reaction Details
TargetBeta-2 adrenergic receptor
LigandBDBM50578593
Substrate/Competitorn/a
Meas. Tech.ChEMBL_2133588 (CHEMBL4843198)
EC50 0.033884±n/a nM
Citation Xing, GZhi, ZYi, CZou, JJing, XYiu-Ho Woo, ALin, BPan, LZhang, YCheng, M 8-Hydroxyquinolin-2(1H)-one analogues as potential ? Eur J Med Chem224:0 (2021) 
 
Beta-2 adrenergic receptor
Name:Beta-2 adrenergic receptor
Type:n/a
Mol. Mass.:46461.69
Organism:Homo sapiens (Human)
Description:P07550
Residue:413
BDBM50578593
NameBDBM50578593
Synonyms:CHEMBL4860764
TypeSmall organic molecule
Emp. Form.C21H24Cl2N2O3
Mol. Mass.423.333
SMILESCl.CC(CCc1ccccc1Cl)NCC(O)c1ccc(O)c2[nH]c(=O)ccc12