Reaction Details
TargetBeta-2 adrenergic receptor
LigandBDBM50578597
Substrate/Competitorn/a
Meas. Tech.ChEMBL_2133588 (CHEMBL4843198)
EC50 0.021380±n/a nM
Citation Xing, GZhi, ZYi, CZou, JJing, XYiu-Ho Woo, ALin, BPan, LZhang, YCheng, M 8-Hydroxyquinolin-2(1H)-one analogues as potential ? Eur J Med Chem224:0 (2021) 
 
Beta-2 adrenergic receptor
Name:Beta-2 adrenergic receptor
Type:n/a
Mol. Mass.:46461.69
Organism:Homo sapiens (Human)
Description:P07550
Residue:413
BDBM50578597
NameBDBM50578597
Synonyms:CHEMBL4863282
TypeSmall organic molecule
Emp. Form.C22H27ClN2O4
Mol. Mass.418.914
SMILESCl.COc1cccc(CCC(C)NCC(O)c2ccc(O)c3[nH]c(=O)ccc23)c1