Reaction Details
TargetBeta-2 adrenergic receptor
LigandBDBM50578604
Substrate/Competitorn/a
Meas. Tech.ChEMBL_2133588 (CHEMBL4843198)
EC50 0.010715±n/a nM
Citation Xing, GZhi, ZYi, CZou, JJing, XYiu-Ho Woo, ALin, BPan, LZhang, YCheng, M 8-Hydroxyquinolin-2(1H)-one analogues as potential ? Eur J Med Chem224:0 (2021) 
 
Beta-2 adrenergic receptor
Name:Beta-2 adrenergic receptor
Type:n/a
Mol. Mass.:46461.69
Organism:Homo sapiens (Human)
Description:P07550
Residue:413
BDBM50578604
NameBDBM50578604
Synonyms:CHEMBL4847536
TypeSmall organic molecule
Emp. Form.C21H25ClN2O4
Mol. Mass.404.887
SMILESCl.CC(CCc1ccc(O)cc1)NCC(O)c1ccc(O)c2[nH]c(=O)ccc12