Reaction Details
TargetEndothelin-1 receptor
LigandBDBM50146713
Substrate/Competitorn/a
Meas. Tech.ChEMBL_65482 (CHEMBL682357)
IC50 3.7±n/a nM
Citation Bolli, MHMarfurt, JGrisostomi, CBoss, CBinkert, CHess, PTreiber, AThorin, EMorrison, KBuchmann, SBur, DRamuz, HClozel, MFischli, WWeller, T Novel benzo[1,4]diazepin-2-one derivatives as endothelin receptor antagonists. J Med Chem47:2776-95 (2004) 
 
Endothelin-1 receptor
Name:Endothelin-1 receptor
Type:Enzyme Catalytic Domain
Mol. Mass.:48736.88
Organism:Homo sapiens (Human)
Description:P25101
Residue:427
BDBM50146713
NameBDBM50146713
Synonyms:(S)-[(S)-1-(2,3-Difluoro-benzyl)-2-oxo-5-phenyl-2,3,4,5-tetrahydro-1H-benzo[e][1,4]diazepin-5-yl]-(4,6-dimethyl-pyrimidin-2-yloxy)-acetic acid | CHEMBL93820
TypeSmall organic molecule
Emp. Form.C30H26F2N4O4
Mol. Mass.544.5486
SMILESCc1cc(C)nc(O[C@H](C(O)=O)[C@]2(NCC(=O)N(Cc3cccc(F)c3F)c3ccccc23)c2ccccc2)n1