Reaction Details
TargetMyc proto-oncogene protein
LigandBDBM331520
Substrate/Competitorn/a
Meas. Tech.ChEMBL_2145528 (CHEMBL5029808)
IC50 6.9±n/a nM
Citation Hill, MDQuesnelle, CTokarski, JFang, HFanslau, CHaarhoff, ZKramer, MMadari, SWiebesiek, AMorrison, JSimmermacher-Mayer, JSinz, MWesthouse, RXie, CZhao, JHuang, LSheriff, SYan, CMarsilio, FEverlof, GZvyaga, TLee, FGavai, AVDegnan, AP Development of BET inhibitors as potential treatments for cancer: A new carboline chemotype. Bioorg Med Chem Lett51:0 (2021) 
 
Myc proto-oncogene protein
Name:Myc proto-oncogene protein
Type:PROTEIN
Mol. Mass.:48794.95
Organism:Homo sapiens (Human)
Description:ChEMBL_935266
Residue:439
BDBM331520
NameBDBM331520
Synonyms:2-{11-[4-(2H3)Methyl-1-methyl-1H-1,2,3-triazol-5-yl]-8-[(S)-(oxan-4-yl)(phenyl)methyl]-3,8,12-triazatricyclo[7.4.0.02,7]trideca-1 US9725449, Example 364
TypeSmall organic molecule
Emp. Form.C29H32N6O2
Mol. Mass.496.6034
SMILESCc1nnn(C)c1-c1cc2n([C@@H](C3CCOCC3)c3ccccc3)c3cc(cnc3c2cn1)C(C)(C)O