Reaction Details
TargetE3 ubiquitin-protein ligase Mdm2
LigandBDBM50433561
Substrate/Competitorn/a
Meas. Tech.ChEMBL_2145775 (CHEMBL5030055)
Ki 0.880000±n/a nM
Citation Reutershan, MHMachacek, MRAltman, MDBogen, SCai, MCammarano, CChen, DChristopher, MCryan, JDaublain, PFradera, XGeda, PGoldenblatt, PHill, ADKemper, RAKutilek, VLi, CMartinez, MMcCoy, MNair, LPan, WThompson, CFScapin, GShizuka, MSpatz, MLSteinhuebel, DSun, BVoss, MEWang, XYang, LYeh, TCDussault, IMarshall, CGTrotter, BW Discovery of  J Med Chem64:16213-16241 (2021) 
 
E3 ubiquitin-protein ligase Mdm2
Name:E3 ubiquitin-protein ligase Mdm2
Type:Oncoprotein
Mol. Mass.:55196.54
Organism:Homo sapiens (Human)
Description:Q00987
Residue:491
BDBM50433561
NameBDBM50433561
Synonyms:CHEMBL2381408
TypeSmall organic molecule
Emp. Form.C29H34Cl2FN3O3
Mol. Mass.562.503
SMILESCC(C)(C)C[C@@H]1N[C@H]([C@H](c2cccc(Cl)c2F)[C@]11C(=O)Nc2cc(Cl)ccc12)C(=O)N[C@H]1CC[C@H](O)CC1