Reaction Details
TargetHormone-sensitive lipase
LigandBDBM50147251
Substrate/Competitorn/a
Meas. Tech.ChEBML_88045
IC50 2±n/a nM
Citation Lowe, DBMagnuson, SQi, NCampbell, AMCook, JHong, ZWang, MRodriguez, MAchebe, FKluender, HWong, WCBullock, WHSalhanick, AIWitman-Jones, TBowling, MEKeiper, CClairmont, KB In vitro SAR of (5-(2H)-isoxazolonyl) ureas, potent inhibitors of hormone-sensitive lipase. Bioorg Med Chem Lett14:3155-9 (2004) 
 
Hormone-sensitive lipase
Name:Hormone-sensitive lipase
Type:Protein
Mol. Mass.:116599.07
Organism:Homo sapiens (Human)
Description:Q05469
Residue:1076
BDBM50147251
NameBDBM50147251
Synonyms:4-Isopropyl-3-methyl-5-oxo-5H-isoxazole-2-carboxylic acid methyl-thiophen-2-ylmethyl-amide CHEMBL107197
TypeSmall organic molecule
Emp. Form.C14H18N2O3S
Mol. Mass.294.369
SMILESCC(C)c1c(C)n(oc1=O)C(=O)N(C)Cc1cccs1