Reaction Details
TargetHormone-sensitive lipase
LigandBDBM50147244
Substrate/Competitorn/a
Meas. Tech.ChEBML_88045
IC50 6±n/a nM
Citation Lowe, DBMagnuson, SQi, NCampbell, AMCook, JHong, ZWang, MRodriguez, MAchebe, FKluender, HWong, WCBullock, WHSalhanick, AIWitman-Jones, TBowling, MEKeiper, CClairmont, KB In vitro SAR of (5-(2H)-isoxazolonyl) ureas, potent inhibitors of hormone-sensitive lipase. Bioorg Med Chem Lett14:3155-9 (2004) 
 
Hormone-sensitive lipase
Name:Hormone-sensitive lipase
Type:Protein
Mol. Mass.:116599.07
Organism:Homo sapiens (Human)
Description:Q05469
Residue:1076
BDBM50147244
NameBDBM50147244
Synonyms:1-(4-Isopropyl-3-methyl-5-oxo-5H-isoxazole-2-carbonyl)-piperidine-4-carboxylic acid ethyl ester ethyl 1-(4-isopropyl-3-methyl-5-oxo-2,5-dihydroisoxazole-2-carbonyl)piperidine-4-carboxylate
TypeSmall organic molecule
Emp. Form.C16H24N2O5
Mol. Mass.324.3722
SMILESCCOC(=O)C1CCN(CC1)C(=O)n1oc(=O)c(C(C)C)c1C