Reaction Details
TargetHormone-sensitive lipase
LigandBDBM50147248
Substrate/Competitorn/a
Meas. Tech.ChEMBL_517 (CHEMBL615539)
IC50 5±n/a nM
Citation Lowe, DBMagnuson, SQi, NCampbell, AMCook, JHong, ZWang, MRodriguez, MAchebe, FKluender, HWong, WCBullock, WHSalhanick, AIWitman-Jones, TBowling, MEKeiper, CClairmont, KB In vitro SAR of (5-(2H)-isoxazolonyl) ureas, potent inhibitors of hormone-sensitive lipase. Bioorg Med Chem Lett14:3155-9 (2004) 
 
Hormone-sensitive lipase
Name:Hormone-sensitive lipase
Type:Protein
Mol. Mass.:116599.07
Organism:Homo sapiens (Human)
Description:Q05469
Residue:1076
BDBM50147248
NameBDBM50147248
Synonyms:4-(2-Methoxy-ethyl)-3-methyl-2-(4-phenyl-piperidine-1-carbonyl)-2H-isoxazol-5-one CHEMBL320249
TypeSmall organic molecule
Emp. Form.C19H24N2O4
Mol. Mass.344.4049
SMILESCOCCc1c(C)n(oc1=O)C(=O)N1CCC(CC1)c1ccccc1