Reaction Details
TargetHormone-sensitive lipase
LigandBDBM50147297
Substrate/Competitorn/a
Meas. Tech.ChEBML_88045
IC50 1±n/a nM
Citation Lowe, DBMagnuson, SQi, NCampbell, AMCook, JHong, ZWang, MRodriguez, MAchebe, FKluender, HWong, WCBullock, WHSalhanick, AIWitman-Jones, TBowling, MEKeiper, CClairmont, KB In vitro SAR of (5-(2H)-isoxazolonyl) ureas, potent inhibitors of hormone-sensitive lipase. Bioorg Med Chem Lett14:3155-9 (2004) 
 
Hormone-sensitive lipase
Name:Hormone-sensitive lipase
Type:Protein
Mol. Mass.:116599.07
Organism:Homo sapiens (Human)
Description:Q05469
Residue:1076
BDBM50147297
NameBDBM50147297
Synonyms:4-Isopropyl-2-[4-(3-methoxy-phenyl)-piperazine-1-carbonyl]-3-methyl-2H-isoxazol-5-one | CHEMBL419197
TypeSmall organic molecule
Emp. Form.C19H25N3O4
Mol. Mass.359.4195
SMILESCOc1cccc(c1)N1CCN(CC1)C(=O)n1oc(=O)c(C(C)C)c1C