Reaction Details
TargetSphingosine 1-phosphate receptor 1
LigandBDBM50148416
Substrate/Competitorn/a
Meas. Tech.ChEBML_201315
IC50 0.900000±n/a nM
Citation Hale, JJDoherty, GToth, LMills, SGHajdu, RKeohane, CARosenbach, MMilligan, JShei, GJChrebet, GBergstrom, JCard, DForrest, MSun, SYWest, SXie, HNomura, NRosen, HMandala, S Selecting against S1P3 enhances the acute cardiovascular tolerability of 3-(N-benzyl)aminopropylphosphonic acid S1P receptor agonists. Bioorg Med Chem Lett14:3501-5 (2004) 
 
Sphingosine 1-phosphate receptor 1
Name:Sphingosine 1-phosphate receptor 1
Type:Enzyme
Mol. Mass.:42836.02
Organism:Homo sapiens (Human)
Description:P21453
Residue:382
BDBM50148416
NameBDBM50148416
Synonyms:CHEMBL115970 | [3-(4-Nonanoyl-benzylamino)-propyl]-phosphonic acid
TypeSmall organic molecule
Emp. Form.C19H32NO4P
Mol. Mass.369.4354
SMILESCCCCCCCCC(=O)c1ccc(CNCCCP(O)(O)=O)cc1