Reaction Details
TargetSphingosine 1-phosphate receptor 1
LigandBDBM50148420
Substrate/Competitorn/a
Meas. Tech.ChEBML_201315
IC50 2.4±n/a nM
Citation Hale, JJDoherty, GToth, LMills, SGHajdu, RKeohane, CARosenbach, MMilligan, JShei, GJChrebet, GBergstrom, JCard, DForrest, MSun, SYWest, SXie, HNomura, NRosen, HMandala, S Selecting against S1P3 enhances the acute cardiovascular tolerability of 3-(N-benzyl)aminopropylphosphonic acid S1P receptor agonists. Bioorg Med Chem Lett14:3501-5 (2004) 
 
Sphingosine 1-phosphate receptor 1
Name:Sphingosine 1-phosphate receptor 1
Type:Enzyme
Mol. Mass.:42836.02
Organism:Homo sapiens (Human)
Description:P21453
Residue:382
BDBM50148420
NameBDBM50148420
Synonyms:CHEMBL117715 | [3-(3-Chloro-5-methoxy-4-octyloxy-benzylamino)-propyl]-phosphonic acid
TypeSmall organic molecule
Emp. Form.C19H33ClNO5P
Mol. Mass.421.896
SMILESCCCCCCCCOc1c(Cl)cc(CNCCCP(O)(O)=O)cc1OC