Reaction Details
TargetSphingosine 1-phosphate receptor 1
LigandBDBM50148436
Substrate/Competitorn/a
Meas. Tech.ChEBML_201315
IC50 0.500000±n/a nM
Citation Hale, JJDoherty, GToth, LMills, SGHajdu, RKeohane, CARosenbach, MMilligan, JShei, GJChrebet, GBergstrom, JCard, DForrest, MSun, SYWest, SXie, HNomura, NRosen, HMandala, S Selecting against S1P3 enhances the acute cardiovascular tolerability of 3-(N-benzyl)aminopropylphosphonic acid S1P receptor agonists. Bioorg Med Chem Lett14:3501-5 (2004) 
 
Sphingosine 1-phosphate receptor 1
Name:Sphingosine 1-phosphate receptor 1
Type:Enzyme
Mol. Mass.:42836.02
Organism:Homo sapiens (Human)
Description:P21453
Residue:382
BDBM50148436
NameBDBM50148436
Synonyms:CHEMBL119382 | {3-[4-(2-Heptyl-2H-tetrazol-5-yl)-benzylamino]-propyl}-phosphonic acid
TypeSmall organic molecule
Emp. Form.C18H30N5O3P
Mol. Mass.395.4363
SMILESCCCCCCCn1nnc(n1)-c1ccc(CNCCCP(O)(O)=O)cc1