Reaction Details
TargetSphingosine 1-phosphate receptor 3
LigandBDBM50148435
Substrate/Competitorn/a
Meas. Tech.ChEBML_201333
IC50 13±n/a nM
Citation Hale, JJDoherty, GToth, LMills, SGHajdu, RKeohane, CARosenbach, MMilligan, JShei, GJChrebet, GBergstrom, JCard, DForrest, MSun, SYWest, SXie, HNomura, NRosen, HMandala, S Selecting against S1P3 enhances the acute cardiovascular tolerability of 3-(N-benzyl)aminopropylphosphonic acid S1P receptor agonists. Bioorg Med Chem Lett14:3501-5 (2004) 
 
Sphingosine 1-phosphate receptor 3
Name:Sphingosine 1-phosphate receptor 3
Type:G Protein-Coupled Receptor (GPCR)
Mol. Mass.:42278.13
Organism:Homo sapiens (Human)
Description:Q99500
Residue:378
BDBM50148435
NameBDBM50148435
Synonyms:CHEMBL119116 | [3-(3,5-Dichloro-4-octyloxy-benzylamino)-propyl]-phosphonic acid
TypeSmall organic molecule
Emp. Form.C18H30Cl2NO4P
Mol. Mass.426.315
SMILESCCCCCCCCOc1c(Cl)cc(CNCCCP(O)(O)=O)cc1Cl