Reaction Details
TargetGonadotropin-releasing hormone receptor
LigandBDBM50149255
Substrate/Competitorn/a
Meas. Tech.ChEMBL_71435 (CHEMBL685307)
Ki 0.6±n/a nM
Citation Tucci, FCZhu, YFGuo, ZGross, TDConnors, PJGao, YRowbottom, MWStruthers, RSReinhart, GJXie, QChen, TKBozigian, HKillam Bonneville, ALFisher, AJin, LSaunders, JChen, C 3-(2-aminoalkyl)-1-(2,6-difluorobenzyl)-5- (2-fluoro-3-methoxyphenyl)-6-methyl-uracils as orally bioavailable antagonists of the human gonadotropin releasing hormone receptor. J Med Chem47:3483-6 (2004) 
 
Gonadotropin-releasing hormone receptor
Name:Gonadotropin-releasing hormone receptor
Type:Enzyme
Mol. Mass.:37749.45
Organism:Homo sapiens (Human)
Description:P30968
Residue:328
BDBM50149255
NameBDBM50149255
Synonyms:3-((R)-2-Cyclopentyl-2-dimethylamino-ethyl)-1-(2,6-difluoro-benzyl)-5-(2-fluoro-3-methoxy-phenyl)-6-methyl-1H-pyrimidine-2,4-dione | CHEMBL115703
TypeSmall organic molecule
Emp. Form.C28H32F3N3O3
Mol. Mass.515.5672
SMILESCOc1cccc(c1F)-c1c(C)n(Cc2c(F)cccc2F)c(=O)n(C[C@@H](C2CCCC2)N(C)C)c1=O