Reaction Details
TargetInhibitor of nuclear factor kappa-B kinase subunit beta
LigandBDBM50149846
Substrate/Competitorn/a
Meas. Tech.ChEMBL_306083 (CHEMBL833584)
IC50 3±n/a nM
Citation Murata, TShimada, MSakakibara, SYoshino, TMasuda, TShintani, TSato, HKoriyama, YFukushima, KNunami, NYamauchi, MFuchikami, KKomura, HWatanabe, AZiegelbauer, KBBacon, KBLowinger, TB Synthesis and structure-activity relationships of novel IKK-beta inhibitors. Part 3: Orally active anti-inflammatory agents. Bioorg Med Chem Lett14:4019-22 (2004) 
 
Inhibitor of nuclear factor kappa-B kinase subunit beta
Name:Inhibitor of nuclear factor kappa-B kinase subunit beta
Type:Serine/threonine-protein kinase
Mol. Mass.:86554.39
Organism:Homo sapiens (Human)
Description:GST-tagged IKK-2 was expressed in High Five cells and purified.
Residue:756
BDBM50149846
NameBDBM50149846
Synonyms:2''-Amino-6''-(2-cyclopropylmethoxy-6-hydroxy-phenyl)-1,2,3,4,5,6-hexahydro-[3,4'']bipyridinyl-3''-carbonitrile | CHEMBL182407
TypeSmall organic molecule
Emp. Form.C21H24N4O2
Mol. Mass.364.4409
SMILESNc1nc(cc(C2CCCNC2)c1C#N)-c1c(O)cccc1OCC1CC1