Reaction Details
TargetMas-related G-protein coupled receptor member X1
LigandBDBM50583454
Substrate/Competitorn/a
Meas. Tech.ChEMBL_2157377 (CHEMBL5042037)
EC50 1600±n/a nM
Citation Berhane, IHin, NThomas, AGHuang, QZhang, CVeeravalli, VWu, YNg, JAlt, JRojas, CHihara, HAoki, MYoshizawa, KNishioka, TSuzuki, SHe, SQPeng, QGuan, YDong, XRaja, SNSlusher, BSRais, RTsukamoto, T Thieno[2,3- J Med Chem65:3218-3228 (2022) 
 
Mas-related G-protein coupled receptor member X1
Name:Mas-related G-protein coupled receptor member X1
Type:PROTEIN
Mol. Mass.:36253.68
Organism:Homo sapiens (Human)
Description:ChEMBL_516621
Residue:322
BDBM50583454
NameBDBM50583454
Synonyms:CHEMBL5070279
TypeSmall organic molecule
Emp. Form.C14H12N2OS
Mol. Mass.256.323
SMILESCc1sc2ncnc(Oc3ccccc3)c2c1C