Reaction Details
TargetMas-related G-protein coupled receptor member X1
LigandBDBM50583458
Substrate/Competitorn/a
Meas. Tech.ChEMBL_2157377 (CHEMBL5042037)
EC50 30000±n/a nM
Citation Berhane, IHin, NThomas, AGHuang, QZhang, CVeeravalli, VWu, YNg, JAlt, JRojas, CHihara, HAoki, MYoshizawa, KNishioka, TSuzuki, SHe, SQPeng, QGuan, YDong, XRaja, SNSlusher, BSRais, RTsukamoto, T Thieno[2,3- J Med Chem65:3218-3228 (2022) 
 
Mas-related G-protein coupled receptor member X1
Name:Mas-related G-protein coupled receptor member X1
Type:PROTEIN
Mol. Mass.:36253.68
Organism:Homo sapiens (Human)
Description:ChEMBL_516621
Residue:322
BDBM50583458
NameBDBM50583458
Synonyms:CHEMBL5077884
TypeSmall organic molecule
Emp. Form.C14H11FN2OS
Mol. Mass.274.313
SMILESCc1sc2ncnc(Oc3cccc(F)c3)c2c1C