Reaction Details
TargetSerine/threonine-protein kinase B-raf
LigandBDBM50585092
Substrate/Competitorn/a
Meas. Tech.ChEMBL_2161539 (CHEMBL5046400)
IC50 0.070000±n/a nM
Citation Abdel-Maksoud, MSEl-Gamal, MILee, BSGamal El-Din, MMJeon, HRKwon, DAmmar, UMMersal, KIAli, EMHLee, KTYoo, KHHan, DKLee, JKKim, GChoi, HSKwon, YJLee, KHOh, CH Discovery of New Imidazo[2,1- J Med Chem64:6877-6901 (2021) 
 
Serine/threonine-protein kinase B-raf
Name:Serine/threonine-protein kinase B-raf
Type:Serine/threonine-protein kinase
Mol. Mass.:84446.00
Organism:Homo sapiens (Human)
Description:P15056
Residue:766
BDBM50585092
NameBDBM50585092
Synonyms:CHEMBL5087577
TypeSmall organic molecule
Emp. Form.C20H21N7O3S2
Mol. Mass.471.556
SMILESCN1CCN(CCNc2nccc(n2)-c2c(nc3sccn23)-c2cccc(O)c2)S1(=O)=O