Reaction Details
TargetRNA-directed RNA polymerase
LigandBDBM50154446
Substrate/Competitorn/a
Meas. Tech.ChEMBL_306662 (CHEMBL831435)
IC50 6000±n/a nM
Citation Summa, VPetrocchi, AMatassa, VGTaliani, MLaufer, RDe Francesco, RAltamura, SPace, P HCV NS5b RNA-dependent RNA polymerase inhibitors: from alpha,gamma-diketoacids to 4,5-dihydroxypyrimidine- or 3-methyl-5-hydroxypyrimidinonecarboxylic acids. Design and synthesis. J Med Chem47:5336-9 (2004) 
 
RNA-directed RNA polymerase
Name:RNA-directed RNA polymerase
Type:Protein
Mol. Mass.:25173.95
Organism:Hepatitis C virus
Description:Q8JXU8
Residue:229
BDBM50154446
NameBDBM50154446
Synonyms:5-Hydroxy-2-(3-hydroxy-phenyl)-1-methyl-6-oxo-1,6-dihydro-pyrimidine-4-carboxylic acid | CHEMBL359981
TypeSmall organic molecule
Emp. Form.C12H10N2O5
Mol. Mass.262.2182
SMILESCn1c(nc(C(O)=O)c(O)c1=O)-c1cccc(O)c1