Reaction Details
TargetCyclin-dependent kinase 5
LigandBDBM50155231
Substrate/Competitorn/a
Meas. Tech.ChEMBL_306160 (CHEMBL832348)
IC50 7±n/a nM
Citation Helal, CJSanner, MACooper, CBGant, TAdam, MLucas, JCKang, ZKupchinsky, SAhlijanian, MKTate, BMenniti, FSKelly, KPeterson, M Discovery and SAR of 2-aminothiazole inhibitors of cyclin-dependent kinase 5/p25 as a potential treatment for Alzheimer's disease. Bioorg Med Chem Lett14:5521-5 (2004) 
 
Cyclin-dependent kinase 5
Name:Cyclin-dependent kinase 5
Type:Enzyme Subunit
Mol. Mass.:33308.61
Organism:Homo sapiens (Human)
Description:n/a
Residue:292
BDBM50155231
NameBDBM50155231
Synonyms:2-(1H-Benzoimidazol-5-yl)-N-(5-cyclobutyl-thiazol-2-yl)-acetamide | CHEMBL186898
TypeSmall organic molecule
Emp. Form.C16H16N4OS
Mol. Mass.312.389
SMILESO=C(Cc1ccc2nc[nH]c2c1)Nc1ncc(s1)C1CCC1