Reaction Details
Target5-hydroxytryptamine receptor 1A
LigandBDBM50156407
Substrate/Competitorn/a
Meas. Tech.ChEMBL_302834 (CHEMBL876361)
Ki 11±n/a nM
Citation Zhang, DKohlman, DKrushinski, JLiang, SYing, BPReilly, JEDinn, SRWainscott, DBNutter, SGough, WNelson, DLSchaus, JMXu, YC Design, synthesis and evaluation of bicyclic benzamides as novel 5-HT1F receptor agonists. Bioorg Med Chem Lett14:6011-6 (2004) 
 
5-hydroxytryptamine receptor 1A
Name:5-hydroxytryptamine receptor 1A
Type:n/a
Mol. Mass.:46122.49
Organism:Homo sapiens (Human)
Description:n/a
Residue:422
BDBM50156407
NameBDBM50156407
Synonyms:4-Fluoro-N-[1-(1-methyl-piperidin-4-yl)-1H-indol-6-yl]-benzamide | CHEMBL361303
TypeSmall organic molecule
Emp. Form.C21H22FN3O
Mol. Mass.351.4173
SMILESCN1CCC(CC1)n1ccc2ccc(NC(=O)c3ccc(F)cc3)cc12