Reaction Details
TargetGlycogen phosphorylase, liver form
LigandBDBM50158247
Substrate/Competitorn/a
Meas. Tech.ChEMBL_304931 (CHEMBL826961)
IC50 140±n/a nM
Citation Wright, SWRath, VLGenereux, PEHageman, DLLevy, CBMcClure, LDMcCoid, SCMcPherson, RKSchelhorn, TMWilder, DEZavadoski, WJGibbs, EMTreadway, JL 5-Chloroindoloyl glycine amide inhibitors of glycogen phosphorylase: synthesis, in vitro, in vivo, and X-ray crystallographic characterization. Bioorg Med Chem Lett15:459-65 (2004) 
 
Glycogen phosphorylase, liver form
Name:Glycogen phosphorylase, liver form
Type:Homodimer
Mol. Mass.:97153.98
Organism:Homo sapiens (Human)
Description:Dimers associate into a tetramer to form the enzymatically active phosphorylase A.
Residue:847
BDBM50158247
NameBDBM50158247
Synonyms:5-Chloro-1H-indole-2-carboxylic acid {[(2-cyano-ethyl)-cyclopentyl-carbamoyl]-methyl}-amide | CHEMBL181473
TypeSmall organic molecule
Emp. Form.C19H21ClN4O2
Mol. Mass.372.849
SMILESClc1ccc2[nH]c(cc2c1)C(=O)NCC(=O)N(CCC#N)C1CCCC1