Reaction Details
TargetGlycogen phosphorylase, liver form
LigandBDBM50158240
Substrate/Competitorn/a
Meas. Tech.ChEMBL_304931 (CHEMBL826961)
IC50 180±n/a nM
Citation Wright, SWRath, VLGenereux, PEHageman, DLLevy, CBMcClure, LDMcCoid, SCMcPherson, RKSchelhorn, TMWilder, DEZavadoski, WJGibbs, EMTreadway, JL 5-Chloroindoloyl glycine amide inhibitors of glycogen phosphorylase: synthesis, in vitro, in vivo, and X-ray crystallographic characterization. Bioorg Med Chem Lett15:459-65 (2004) 
 
Glycogen phosphorylase, liver form
Name:Glycogen phosphorylase, liver form
Type:Homodimer
Mol. Mass.:97153.98
Organism:Homo sapiens (Human)
Description:Dimers associate into a tetramer to form the enzymatically active phosphorylase A.
Residue:847
BDBM50158240
NameBDBM50158240
Synonyms:5-Chloro-1H-indole-2-carboxylic acid {[(2-hydroxy-ethyl)-isobutyl-carbamoyl]-methyl}-amide | CHEMBL361860
TypeSmall organic molecule
Emp. Form.C17H22ClN3O3
Mol. Mass.351.828
SMILESCC(C)CN(CCO)C(=O)CNC(=O)c1cc2cc(Cl)ccc2[nH]1