Reaction Details
TargetTyrosine-protein kinase BTK
LigandBDBM50589207
Substrate/Competitorn/a
Meas. Tech.ChEMBL_2192545 (CHEMBL5104905)
IC50 0.400000±n/a nM
Citation Owens, TDBrameld, KAVerner, EJTon, TLi, XZhu, JMasjedizadeh, MRBradshaw, JMHill, RJTam, DBisconte, AKim, EOFrancesco, MXing, YShu, JKarr, DLaStant, JFinkle, DLoewenstein, NHaberstock-Debic, HTaylor, MJNunn, PLangrish, CLGoldstein, DM Discovery of Reversible Covalent Bruton's Tyrosine Kinase Inhibitors PRN473 and PRN1008 (Rilzabrutinib). J Med Chem65:5300-5316 (2022) 
 
Tyrosine-protein kinase BTK
Name:Tyrosine-protein kinase BTK
Type:Enzyme
Mol. Mass.:76289.95
Organism:Homo sapiens (Human)
Description:Q06187
Residue:659
BDBM50589207
NameBDBM50589207
Synonyms:CHEMBL5169419
TypeSmall organic molecule
Emp. Form.C33H36FN9O2
Mol. Mass.609.6964
SMILESCC(C)(\C=C(/C#N)C(=O)N1CCC[C@H](C1)n1nc(-c2ccc(Oc3ccccc3)cc2F)c2c(N)ncnc12)N1CCNCC1