Reaction Details
TargetEstrogen receptor
LigandBDBM50162799
Substrate/Competitorn/a
Meas. Tech.ChEMBL_305467 (CHEMBL831077)
IC50 0.3±n/a nM
Citation Tan, QBlizzard, TAMorgan, JDBirzin, ETChan, WYang, YTPai, LYHayes, ECDaSilva, CAWarrier, SYudkovitz, JWilkinson, HASharma, NFitzgerald, PMLi, SColwell, LFisher, JEAdamski, SReszka, AAKimmel, DDiNinno, FRohrer, SPFreedman, LPSchaeffer, JMHammond, ML Estrogen receptor ligands. Part 10: Chromanes: old scaffolds for new SERAMs. Bioorg Med Chem Lett15:1675-81 (2005) 
 
Estrogen receptor
Name:Estrogen receptor
Type:Protein
Mol. Mass.:66230.44
Organism:Homo sapiens (Human)
Description:P03372
Residue:595
BDBM50162799
NameBDBM50162799
Synonyms:(2R,3R,4S)-2-[4-(2-Azepan-1-yl-ethoxy)-phenyl]-5-fluoro-3-(4-hydroxy-phenyl)-4-methyl-chroman-6-ol | CHEMBL181368
TypeSmall organic molecule
Emp. Form.C30H34FNO4
Mol. Mass.491.5937
SMILESC[C@H]1[C@@H]([C@@H](Oc2ccc(O)c(F)c12)c1ccc(OCCN2CCCCCC2)cc1)c1ccc(O)cc1