Reaction Details
TargetProstaglandin D2 receptor 2
LigandBDBM50162903
Substrate/Competitorn/a
Meas. Tech.ChEMBL_308693 (CHEMBL875722)
Ki 13±n/a nM
Citation Robarge, MJBom, DCTumey, LNVarga, NGleason, ESilver, DSong, JMurphy, SMEkema, GDoucette, CHanniford, DPalmer, MPawlowski, GDanzig, JLoftus, MHunady, KSherf, BAMays, RWStricker-Krongrad, ABrunden, KRHarrington, JJBennani, YL Isosteric ramatroban analogs: selective and potent CRTH-2 antagonists. Bioorg Med Chem Lett15:1749-53 (2005) 
 
Prostaglandin D2 receptor 2
Name:Prostaglandin D2 receptor 2
Type:Enzyme
Mol. Mass.:43295.45
Organism:Homo sapiens (Human)
Description:Q9Y5Y4
Residue:395
BDBM50162903
NameBDBM50162903
Synonyms:CHEMBL359855 | [6-(4-Fluoro-benzenesulfonylamino)-3-methyl-1,2,3,4-tetrahydro-carbazol-9-yl]-acetic acid
TypeSmall organic molecule
Emp. Form.C21H21FN2O4S
Mol. Mass.416.466
SMILESCC1CCc2c(C1)c1cc(NS(=O)(=O)c3ccc(F)cc3)ccc1n2CC(O)=O