Reaction Details
TargetProstaglandin D2 receptor 2
LigandBDBM50162918
Substrate/Competitorn/a
Meas. Tech.ChEMBL_308687 (CHEMBL834127)
Ki 2100±n/a nM
Citation Robarge, MJBom, DCTumey, LNVarga, NGleason, ESilver, DSong, JMurphy, SMEkema, GDoucette, CHanniford, DPalmer, MPawlowski, GDanzig, JLoftus, MHunady, KSherf, BAMays, RWStricker-Krongrad, ABrunden, KRHarrington, JJBennani, YL Isosteric ramatroban analogs: selective and potent CRTH-2 antagonists. Bioorg Med Chem Lett15:1749-53 (2005) 
 
Prostaglandin D2 receptor 2
Name:Prostaglandin D2 receptor 2
Type:Enzyme
Mol. Mass.:43295.45
Organism:Homo sapiens (Human)
Description:Q9Y5Y4
Residue:395
BDBM50162918
NameBDBM50162918
Synonyms:3-[6-(4-Methoxy-benzenesulfonylamino)-1,2,3,4-tetrahydro-carbazol-9-yl]-propionic acid | CHEMBL180628
TypeSmall organic molecule
Emp. Form.C22H24N2O5S
Mol. Mass.428.501
SMILESCOc1ccc(cc1)S(=O)(=O)Nc1ccc2n(CCC(O)=O)c3CCCCc3c2c1