Reaction Details
TargetInsulin receptor
LigandBDBM50162994
Substrate/Competitorn/a
Meas. Tech.ChEMBL_305383 (CHEMBL832897)
IC50>10000±n/a nM
Citation Zhang, HCDerian, CKMcComsey, DFWhite, KBYe, HHecker, LRLi, JAddo, MFCroll, DEckardt, AJSmith, CELi, QCheung, WMConway, BREmanuel, SDemarest, KTAndrade-Gordon, PDamiano, BPMaryanoff, BE Novel indolylindazolylmaleimides as inhibitors of protein kinase C-beta: synthesis, biological activity, and cardiovascular safety. J Med Chem48:1725-8 (2005) 
 
Insulin receptor
Name:Insulin receptor
Type:PROTEIN
Mol. Mass.:155593.32
Organism:Mus musculus
Description:ChEMBL_305383
Residue:1372
BDBM50162994
NameBDBM50162994
Synonyms:3-[1-(3-Dimethylamino-propyl)-1H-indazol-3-yl]-4-[1-(1,4,4a,8a-tetrahydro-naphthalen-1-yl)-1H-indol-3-yl]-pyrrole-2,5-dione | CHEMBL360304
TypeSmall organic molecule
Emp. Form.C34H29N5O2
Mol. Mass.539.6264
SMILESCN(C)CCCn1nc(C2=C(C(=O)NC2=O)c2cn(-c3cccc4ccccc34)c3ccccc23)c2ccccc12