Reaction Details
TargetProtein kinase C beta type
LigandBDBM50162995
Substrate/Competitorn/a
Meas. Tech.ChEMBL_312615 (CHEMBL834104)
IC50 170±n/a nM
Citation Zhang, HCDerian, CKMcComsey, DFWhite, KBYe, HHecker, LRLi, JAddo, MFCroll, DEckardt, AJSmith, CELi, QCheung, WMConway, BREmanuel, SDemarest, KTAndrade-Gordon, PDamiano, BPMaryanoff, BE Novel indolylindazolylmaleimides as inhibitors of protein kinase C-beta: synthesis, biological activity, and cardiovascular safety. J Med Chem48:1725-8 (2005) 
 
Protein kinase C beta type
Name:Protein kinase C beta type
Type:Enzyme
Mol. Mass.:76873.67
Organism:Homo sapiens (Human)
Description:The recombinant human PKC enzymes were produced using a baculovirus expression system in SF9 cells
Residue:671
BDBM50162995
NameBDBM50162995
Synonyms:3-[1-(1,2-Dihydro-pyridin-2-yl)-1H-indazol-3-yl]-4-[1-(1,4,4a,8a-tetrahydro-naphthalen-2-yl)-1H-indol-3-yl]-pyrrole-2,5-dione | CHEMBL367107
TypeSmall organic molecule
Emp. Form.C36H31N5O2
Mol. Mass.565.6636
SMILESO=C1NC(=O)C(=C1c1cn(-c2ccc3ccccc3c2)c2ccccc12)c1nn(CCCN2CCCC2)c2ccccc12