Reaction Details
TargetCyclin-dependent kinase 1
LigandBDBM50162998
Substrate/Competitorn/a
Meas. Tech.ChEMBL_305914 (CHEMBL832629)
IC50 400±n/a nM
Citation Zhang, HCDerian, CKMcComsey, DFWhite, KBYe, HHecker, LRLi, JAddo, MFCroll, DEckardt, AJSmith, CELi, QCheung, WMConway, BREmanuel, SDemarest, KTAndrade-Gordon, PDamiano, BPMaryanoff, BE Novel indolylindazolylmaleimides as inhibitors of protein kinase C-beta: synthesis, biological activity, and cardiovascular safety. J Med Chem48:1725-8 (2005) 
 
Cyclin-dependent kinase 1
Name:Cyclin-dependent kinase 1
Type:PROTEIN
Mol. Mass.:34112.70
Organism:Mus musculus
Description:ChEMBL_305914
Residue:297
BDBM50162998
NameBDBM50162998
Synonyms:3-[1-(3-Dimethylamino-propyl)-1H-indazol-3-yl]-4-(1-thiophen-2-yl-1H-indol-3-yl)-pyrrole-2,5-dione | CHEMBL178945
TypeSmall organic molecule
Emp. Form.C28H25N5O2S
Mol. Mass.495.595
SMILESCN(C)CCCn1nc(C2=C(C(=O)NC2=O)c2cn(-c3cccs3)c3ccccc23)c2ccccc12