Reaction Details
TargetGlycogen synthase kinase-3 beta
LigandBDBM50162991
Substrate/Competitorn/a
Meas. Tech.ChEMBL_305464 (CHEMBL830960)
IC50 4800±n/a nM
Citation Zhang, HCDerian, CKMcComsey, DFWhite, KBYe, HHecker, LRLi, JAddo, MFCroll, DEckardt, AJSmith, CELi, QCheung, WMConway, BREmanuel, SDemarest, KTAndrade-Gordon, PDamiano, BPMaryanoff, BE Novel indolylindazolylmaleimides as inhibitors of protein kinase C-beta: synthesis, biological activity, and cardiovascular safety. J Med Chem48:1725-8 (2005) 
 
Glycogen synthase kinase-3 beta
Name:Glycogen synthase kinase-3 beta
Type:Enzyme
Mol. Mass.:46756.38
Organism:Homo sapiens (Human)
Description:P49841
Residue:420
BDBM50162991
NameBDBM50162991
Synonyms:3-(1-Benzo[b]thiophen-2-yl-1H-indol-3-yl)-4-[1-(3-dimethylamino-propyl)-1H-indazol-3-yl]-pyrrole-2,5-dione | CHEMBL426587
TypeSmall organic molecule
Emp. Form.C32H27N5O2S
Mol. Mass.545.654
SMILESCN(C)CCCn1nc(C2=C(C(=O)NC2=O)c2cn(-c3csc4ccccc34)c3ccccc23)c2ccccc12