Reaction Details
TargetAmyloid-beta precursor protein
LigandBDBM28960
Substrate/Competitorn/a
Meas. Tech.ChEMBL_304202 (CHEMBL829742)
EC50 100±n/a nM
Citation Gundersen, EFan, KHaas, KHuryn, DSteven Jacobsen, JKreft, AMartone, RMayer, SSonnenberg-Reines, JSun, SCZhou, H Molecular-modeling based design, synthesis, and activity of substituted piperidines as gamma-secretase inhibitors. Bioorg Med Chem Lett15:1891-4 (2005) 
 
Amyloid-beta precursor protein
Name:Amyloid-beta precursor protein
Type:Single-pass type I membrane protein
Mol. Mass.:86890.41
Organism:Homo sapiens (Human)
Description:P05067
Residue:770
BDBM28960
NameBDBM28960
Synonyms:(2R)-2-{[5-chloro-2-(hydroxymethyl)phenyl](4-chlorobenzene)sulfonamido}propyl N-propylcarbamate CHEMBL181204 | phenylsulfonamide, 1a
TypeSmall organic molecule
Emp. Form.C20H24Cl2N2O5S
Mol. Mass.475.386
SMILESCCCNC(=O)OC[C@@H](C)N(c1cc(Cl)ccc1CO)S(=O)(=O)c1ccc(Cl)cc1