Reaction Details
TargetCytochrome P450 3A4
LigandBDBM50164232
Substrate/Competitorn/a
Meas. Tech.ChEMBL_304712 (CHEMBL827153)
IC50 6.3±n/a nM
Citation de Dios, AShih, CLópez de Uralde, BSánchez, Cdel Prado, MMartín Cabrejas, LMPleite, SBlanco-Urgoiti, JLorite, MJNevill, CRBonjouklian, RYork, JVieth, MWang, YMagnus, NCampbell, RMAnderson, BDMcCann, DJGiera, DDLee, PASchultz, RMLi, LCJohnson, LMWolos, JA Design of potent and selective 2-aminobenzimidazole-based p38alpha MAP kinase inhibitors with excellent in vivo efficacy. J Med Chem48:2270-3 (2005) 
 
Cytochrome P450 3A4
Name:Cytochrome P450 3A4
Type:Enzyme
Mol. Mass.:57349.57
Organism:Homo sapiens (Human)
Description:n/a
Residue:503
BDBM50164232
NameBDBM50164232
Synonyms:6-(2-(2,6-difluorophenyl)-4-phenyl-1H-imidazol-5-yl)-1-(isopropylsulfonyl)-1H-benzo[d]imidazol-2-amine CHEMBL364572
TypeSmall organic molecule
Emp. Form.C25H21F2N5O2S
Mol. Mass.493.528
SMILESCC(C)S(=O)(=O)n1c(N)nc2ccc(cc12)-c1[nH]c(nc1-c1ccccc1)-c1c(F)cccc1F