Reaction Details
TargetMitogen-activated protein kinase 14
LigandBDBM50164237
Substrate/Competitorn/a
Meas. Tech.ChEMBL_306714 (CHEMBL832299)
IC50 22.8±n/a nM
Citation de Dios, AShih, CLópez de Uralde, BSánchez, Cdel Prado, MMartín Cabrejas, LMPleite, SBlanco-Urgoiti, JLorite, MJNevill, CRBonjouklian, RYork, JVieth, MWang, YMagnus, NCampbell, RMAnderson, BDMcCann, DJGiera, DDLee, PASchultz, RMLi, LCJohnson, LMWolos, JA Design of potent and selective 2-aminobenzimidazole-based p38alpha MAP kinase inhibitors with excellent in vivo efficacy. J Med Chem48:2270-3 (2005) 
 
Mitogen-activated protein kinase 14
Name:Mitogen-activated protein kinase 14
Type:Serine/threonine-protein kinase
Mol. Mass.:41286.76
Organism:Homo sapiens (Human)
Description:Q16539
Residue:360
BDBM50164237
NameBDBM50164237
Synonyms:2-Amino-6-[2-(2,6-difluoro-phenyl)-5-phenyl-3H-imidazol-4-yl]-benzoimidazole-1-sulfonic acid dimethylamide; Bismesylate salt | CHEMBL363852
TypeSmall organic molecule
Emp. Form.C24H20F2N6O2S
Mol. Mass.494.516
SMILESCN(C)S(=O)(=O)n1c(N)nc2ccc(cc12)-c1[nH]c(nc1-c1ccccc1)-c1c(F)cccc1F