Reaction Details
TargetCyclin-dependent kinase 1
LigandBDBM50164702
Substrate/Competitorn/a
Meas. Tech.ChEMBL_304675 (CHEMBL827874)
IC50 0.1±n/a nM
Citation Verma, SNagarathnam, DShao, JZhang, LZhao, JWang, YLi, TMull, EEnyedy, IWang, CZhu, QAltieri, MJordan, JDang, TTReddy, S Substituted aminobenzimidazole pyrimidines as cyclin-dependent kinase inhibitors. Bioorg Med Chem Lett15:1973-7 (2005) 
 
Cyclin-dependent kinase 1
Name:Cyclin-dependent kinase 1
Type:Enzyme Subunit
Mol. Mass.:34101.08
Organism:Homo sapiens (Human)
Description:P06493
Residue:297
BDBM50164702
NameBDBM50164702
Synonyms:4-[4-(3H-Benzoimidazol-5-ylamino)-5-trifluoromethyl-pyrimidin-2-ylamino]-benzenesulfonamide | CHEMBL194540
TypeSmall organic molecule
Emp. Form.C18H14F3N7O2S
Mol. Mass.449.41
SMILESNS(=O)(=O)c1ccc(Nc2ncc(c(Nc3ccc4nc[nH]c4c3)n2)C(F)(F)F)cc1