Reaction Details
TargetGonadotropin-releasing hormone receptor
LigandBDBM50165518
Substrate/Competitorn/a
Meas. Tech.ChEMBL_305152 (CHEMBL832604)
IC50 18±n/a nM
Citation Tatsuta, MKataoka, MYasoshima, KSakakibara, SShogase, YShimazaki, MYura, TLi, YYamamoto, NGupta, JUrbahns, K Benzimidazoles as non-peptide luteinizing hormone-releasing hormone (LHRH) antagonists. Part 3: Discovery of 1-(1H-benzimidazol-5-yl)-3-tert-butylurea derivatives. Bioorg Med Chem Lett15:2265-9 (2005) 
 
Gonadotropin-releasing hormone receptor
Name:Gonadotropin-releasing hormone receptor
Type:Enzyme
Mol. Mass.:37749.45
Organism:Homo sapiens (Human)
Description:P30968
Residue:328
BDBM50165518
NameBDBM50165518
Synonyms:1-tert-Butyl-3-[2-(2-methoxy-5-nitro-benzylsulfanyl)-1-propyl-1H-benzoimidazol-5-yl]-urea | CHEMBL193749
TypeSmall organic molecule
Emp. Form.C23H29N5O4S
Mol. Mass.471.572
SMILESCCCn1c(SCc2cc(ccc2OC)[N+]([O-])=O)nc2cc(NC(=O)NC(C)(C)C)ccc12