Reaction Details
TargetcGMP-dependent 3',5'-cyclic phosphodiesterase
LigandBDBM14776
Substrate/Competitorn/a
Meas. Tech.ChEMBL_305052 (CHEMBL831689)
IC50>10000±n/a nM
Citation Boyle, CDXu, RAsberom, TChackalamannil, SClader, JWGreenlee, WJGuzik, HHu, YHu, ZLankin, CMPissarnitski, DAStamford, AWWang, YSkell, JKurowski, SVemulapalli, SPalamanda, JChintala, MWu, PMyers, JWang, P Optimization of purine based PDE1/PDE5 inhibitors to a potent and selective PDE5 inhibitor for the treatment of male ED. Bioorg Med Chem Lett15:2365-9 (2005) 
 
cGMP-dependent 3',5'-cyclic phosphodiesterase
Name:cGMP-dependent 3',5'-cyclic phosphodiesterase
Type:Enzyme Catalytic Domain
Mol. Mass.:105691.58
Organism:Homo sapiens (Human)
Description:O00408
Residue:941
BDBM14776
NameBDBM14776
Synonyms:2-{2-ethoxy-5-[(4-ethylpiperazine-1-)sulfonyl]phenyl}-5-methyl-7-propyl-3H,4H-imidazo[1,5-a][1,2,4]triazin-4-one Vardenafil | citric acid;2-[2-ethoxy-5-(4-ethylpiperazino)sulfonyl-phenyl]-5-methyl-7-propyl-1H-imidazo[5,1-f][1,2,4]triazin-4-one
TypeSmall organic molecule
Emp. Form.C23H32N6O4S
Mol. Mass.488.603
SMILESCCCc1nc(C)c2n1nc([nH]c2=O)-c1cc(ccc1OCC)S(=O)(=O)N1CCN(CC)CC1