Reaction Details
TargetExtracellular calcium-sensing receptor
LigandBDBM50166503
Substrate/Competitorn/a
Meas. Tech.ChEMBL_306305 (CHEMBL828597)
IC50 140±n/a nM
Citation Shcherbakova, IHuang, GGeoffroy, OJNair, SKSwierczek, KBalandrin, MFFox, JHeaton, WLConklin, RL Design, new synthesis, and calcilytic activity of substituted 3H-pyrimidin-4-ones. Bioorg Med Chem Lett15:2537-40 (2005) 
 
Extracellular calcium-sensing receptor
Name:Extracellular calcium-sensing receptor
Type:Protein
Mol. Mass.:120663.13
Organism:Homo sapiens (Human)
Description:P41180
Residue:1078
BDBM50166503
NameBDBM50166503
Synonyms:3-[2-(3-Fluoro-phenyl)-ethyl]-2-(2-hydroxy-phenyl)-6-methyl-5-propyl-3H-pyrimidin-4-one | CHEMBL195566
TypeSmall organic molecule
Emp. Form.C22H23FN2O2
Mol. Mass.366.4286
SMILESCCCc1c(C)nc(-c2ccccc2O)n(CCc2cccc(F)c2)c1=O