Reaction Details
TargetExtracellular calcium-sensing receptor
LigandBDBM50166516
Substrate/Competitorn/a
Meas. Tech.ChEMBL_306305 (CHEMBL828597)
IC50 800±n/a nM
Citation Shcherbakova, IHuang, GGeoffroy, OJNair, SKSwierczek, KBalandrin, MFFox, JHeaton, WLConklin, RL Design, new synthesis, and calcilytic activity of substituted 3H-pyrimidin-4-ones. Bioorg Med Chem Lett15:2537-40 (2005) 
 
Extracellular calcium-sensing receptor
Name:Extracellular calcium-sensing receptor
Type:Protein
Mol. Mass.:120663.13
Organism:Homo sapiens (Human)
Description:P41180
Residue:1078
BDBM50166516
NameBDBM50166516
Synonyms:2-(2-Hydroxy-phenyl)-5-methyl-3-phenethyl-6-trifluoromethyl-3H-pyrimidin-4-one | CHEMBL195045
TypeSmall organic molecule
Emp. Form.C20H17F3N2O2
Mol. Mass.374.3564
SMILESCc1c(nc(-c2ccccc2O)n(CCc2ccccc2)c1=O)C(F)(F)F