Reaction Details
TargetcGMP-dependent protein kinase
LigandBDBM50168170
Substrate/Competitorn/a
Meas. Tech.ChEMBL_305951 (CHEMBL831965)
IC50 0.046±n/a nM
Citation Biftu, TFeng, DPonpipom, MGirotra, NLiang, GBQian, XBugianesi, RSimeone, JChang, LGurnett, ALiberator, PDulski, PLeavitt, PSCrumley, TMisura, AMurphy, TRattray, SSamaras, STamas, TMathew, JBrown, CThompson, DSchmatz, DFisher, MWyvratt, M Synthesis and SAR of 2,3-diarylpyrrole inhibitors of parasite cGMP-dependent protein kinase as novel anticoccidial agents. Bioorg Med Chem Lett15:3296-301 (2005) 
 
cGMP-dependent protein kinase
Name:cGMP-dependent protein kinase
Synonyms:n/a
Type:PROTEIN
Mol. Mass.:112911.27
Organism:Eimeria tenella
Description:ChEMBL_469577
Residue:1003
BDBM50168170
NameBDBM50168170
TypeSmall organic molecule
Emp. Form.C23H27FN4
Mol. Mass.378.4857
SMILESNCCCN1CCC(CC1)c1cc(c([nH]1)-c1ccc(F)cc1)-c1ccncc1