Reaction Details
TargetFibroblast growth factor receptor 1/2/3/4
LigandBDBM50168403
Substrate/Competitorn/a
Meas. Tech.ChEMBL_312234 (CHEMBL825076)
IC50 21±n/a nM
Citation Borzilleri, RMZheng, XQian, LEllis, CCai, ZWWautlet, BSMortillo, SJeyaseelan, RKukral, DWFura, AKamath, AVyas, VTokarski, JSBarrish, JCHunt, JTLombardo, LJFargnoli, JBhide, RS Design, synthesis, and evaluation of orally active 4-(2,4-difluoro-5-(methoxycarbamoyl)phenylamino)pyrrolo[2,1-f][1,2,4]triazines as dual vascular endothelial growth factor receptor-2 and fibroblast growth factor receptor-1 inhibitors. J Med Chem48:3991-4008 (2005) 
 
Fibroblast growth factor receptor 1/2/3/4
Name:Fibroblast growth factor receptor 1/2/3/4
Synonyms:Fibroblast growth factor receptor
Type:n/a
Mol. Mass.:n/a
Description:ASSAY_ID of ChEMBL is 2101620
Components:This complex has 4 components.
Component 1
Name:Fibroblast growth factor receptor 3
Type:Protein
Mol. Mass.:87699.57
Organism:Homo sapiens (Human)
Description:P22607
Residue:806
Component 2
Name:Fibroblast growth factor receptor 1
Synonyms:BFGFR Basic fibroblast growth factor receptor 1 (FGFR1) CEK FGFR-1 FGFR-1, (FL) FGFR1_HUMAN FLT2 Fibroblast growth factor receptor 1 (FGFR-1) Fms-like tyrosine kinase 2 N-sam bFGF-R | c-fgr
Type:Receptor
Mol. Mass.:91861.70
Organism:Homo sapiens (Human)
Description:P11362
Residue:822
Component 3
Name:Fibroblast growth factor receptor 4
Synonyms:CD_antigen: CD334 FGFR4 FGFR4 Fibroblast growth factor receptor JK2 TKF
Type:Protein
Mol. Mass.:87957.45
Organism:Homo sapiens (Human)
Description:P22455
Residue:802
Component 4
Name:Fibroblast growth factor receptor 2
Synonyms:BEK FGFR-2 FGFR2 Fibroblast growth factor receptor 2 (FGFR2) KGFR Keratinocyte growth factor receptor VEGF-receptor 2 and Fibroblast growth factor receptor 2
Type:Enzyme
Mol. Mass.:92015.45
Organism:Homo sapiens (Human)
Description:P21802
Residue:821
BDBM50168403
NameBDBM50168403
Synonyms:5-[6-(5-Difluoromethyl-[1,3,4]oxadiazol-2-yl)-5-isopropyl-pyrrolo[2,1-f][1,2,4]triazin-4-ylamino]-2,4-difluoro-N-methoxy-benzamide | CHEMBL194498
TypeSmall organic molecule
Emp. Form.C20H17F4N7O3
Mol. Mass.479.3877
SMILESCONC(=O)c1cc(Nc2ncnn3cc(-c4nnc(o4)C(F)F)c(C(C)C)c23)c(F)cc1F