Reaction Details
TargetVascular endothelial growth factor receptor 1/2/3
LigandBDBM50168393
Substrate/Competitorn/a
Meas. Tech.ChEMBL_312258 (CHEMBL837258)
IC50 6.7±n/a nM
Citation Borzilleri, RMZheng, XQian, LEllis, CCai, ZWWautlet, BSMortillo, SJeyaseelan, RKukral, DWFura, AKamath, AVyas, VTokarski, JSBarrish, JCHunt, JTLombardo, LJFargnoli, JBhide, RS Design, synthesis, and evaluation of orally active 4-(2,4-difluoro-5-(methoxycarbamoyl)phenylamino)pyrrolo[2,1-f][1,2,4]triazines as dual vascular endothelial growth factor receptor-2 and fibroblast growth factor receptor-1 inhibitors. J Med Chem48:3991-4008 (2005) 
 
Vascular endothelial growth factor receptor 1/2/3
Name:Vascular endothelial growth factor receptor 1/2/3
Synonyms:Vascular endothelial growth factor receptor
Type:n/a
Mol. Mass.:n/a
Description:ASSAY_ID of ChEMBL is 213950
Components:This complex has 3 components.
Component 1
Name:Vascular endothelial growth factor receptor 2
Type:Receptor Tyrosine Kinase
Mol. Mass.:151510.97
Organism:Homo sapiens (Human)
Description:P35968
Residue:1356
Component 2
Name:Vascular endothelial growth factor receptor 1
Synonyms:FLT FRT Fms-like tyrosine kinase 1 Tyrosine-protein kinase FRT VEGFR-1 VGFR1_HUMAN Vascular endothelial growth factor receptor 1 (FLT1) Vascular endothelial growth factor receptor 1 and 2 (Flt-1 and KDR) Vascular permeability factor receptor vascular endothelial growth factor/vascular permeability factor receptor
Type:Receptor Tyrosine Kinase
Mol. Mass.:150800.23
Organism:Homo sapiens (Human)
Description:P17948
Residue:1338
Component 3
Name:Vascular endothelial growth factor receptor 3
Synonyms:FLT-4 Fms-like tyrosine kinase 4 VEGFR-3 VGFR3_HUMAN Vascular endothelial growth factor receptor 3 (VEGFR-3) | Vascular endothelial growth factor receptor 3 (VEGFR3)
Type:Protein
Mol. Mass.:152749.58
Organism:Homo sapiens (Human)
Description:P35916-2
Residue:1363
BDBM50168393
NameBDBM50168393
Synonyms:5-[6-(5-Dimethylamino-[1,3,4]oxadiazol-2-yl)-5-isopropyl-pyrrolo[2,1-f][1,2,4]triazin-4-ylamino]-2,4-difluoro-N-methoxy-benzamide | CHEMBL195847
TypeSmall organic molecule
Emp. Form.C21H22F2N8O3
Mol. Mass.472.448
SMILESCONC(=O)c1cc(Nc2ncnn3cc(-c4nnc(o4)N(C)C)c(C(C)C)c23)c(F)cc1F